ElectionId,RaceJurisdictionTypeID,RaceJurisdictionTypeName,RaceJurisdictionID,RaceJurisdictionName,CountyDisplay,RaceID,RaceName,TermLength,TermTypeID,TermFullLabel,BallotID,BallotName,PartyName,MailingAddress,MailingCity,MailingState,MailingZipCode,Phone,Email,Website,RaceLevel,FilingDate,IsWithdrawn,WithdrawnDate,IsWriteIn,AttachmentID,IsPartisanOffice,IsFilingApproved,DisplayOrder
0,2,State Executive,55,Washington State,Statewide,14,Lt. Governor,4,1,4-year term,22477,Brad Owen,(Prefers Democrat Party),1933  E State Route 3,Shelton,WA,98584,(360) 490-9086,bradowen@msn.com,,State,5/14/2012 8:00:00 AM,False,,False,0,True,True,9
0,2,State Executive,55,Washington State,Statewide,19,Commissioner of Public Lands,4,1,4-year term,22479,Peter J. Goldmark,(Prefers Democratic Party),PO Box 12917,Seattle,WA,98111,(206) 913-8619,info@petergoldmark.com,,State,5/14/2012 8:00:00 AM,False,,False,0,True,True,14
0,5,Legislative,63417,Legislative District 12,"Chelan, Douglas, Grant*, Okanogan*",264,State Representative Pos. 2,2,1,2-year term,22478,Brad Hawkins,(Prefers Republican Party),"331 Valley Mall Parkway, Box 319",East Wenatchee,WA,98802,(509) 393-6552,brad@bradhawkins.org,,State,5/14/2012 8:00:00 AM,False,,False,0,True,True,63
0,5,Legislative,63436,Legislative District 31,"King*, Pierce*",321,State Representative Pos. 2,2,1,2-year term,22494,Christopher Hurst,(Prefers Independent Dem. Party),62504 Indian Summer Way E,Enumclaw,WA,98022,(360) 663-2608,chrishurst2010@q.com,,State,5/14/2012 8:00:00 AM,False,,False,0,True,True,120
0,5,Legislative,63444,Legislative District 39,"King*, Skagit*, Snohomish*",345,State Representative Pos. 2,2,1,2-year term,22495,Elizabeth Scott,(Prefers Republican Party),14751 N Kelsey St Ste 105-386,Monroe,WA,98272,(425) 343-5586,elizabeth@elizabeth4state.com,,State,5/14/2012 8:00:00 AM,False,,False,0,True,True,144
0,6,Judicial,63589,Grant Superior Court,Grant,84,Judge Position 2,4,1,4-year term,22694,John Knodell,,509   H St SW,Quincy,WA,98848,(509) 754-2011 ,,,State,5/14/2012 8:00:00 AM,False,,False,0,False,True,240
0,3,Congressional,98412,Congressional District 10,"Mason*, Pierce*, Thurston*",28824,U.S. Representative,2,1,2-year term,22744,Richard (Dick) Muri,(Prefers Republican Party),PO Box 1581,Tacoma,WA,98401,(253) 439-9797,Dick@DickMuri.com,,State,5/14/2012 8:05:00 AM,False,,False,0,True,True,27
0,6,Judicial,63589,Grant Superior Court,Grant,83,Judge Position 1,4,1,4-year term,22704,Evan E Sperline,,19840   St Andrews Dr NW,Soap Lake,WA,98851,(509) 754-2011,,,State,5/14/2012 8:05:00 AM,False,,False,0,False,True,239
0,6,Judicial,63606,Thurston Superior Court,Thurston,214,Judge Position 2,4,1,4-year term,23067,Christine Schaller,,6963 Littlerock Rd SW,Tumwater,WA,98512,(360) 753-0948,Christine@ChristineShallerforJudge.com,,State,5/14/2012 8:06:00 AM,False,,False,0,False,True,379
0,6,Judicial,63592,Jefferson Superior Court,Jefferson,89,Judge Position 1,4,1,4-year term,22623,Keith C Harper,,P O Box 104,Port Townsend,WA,98368,(360) 385-6400,kcharper@olympus.net,,State,5/14/2012 8:19:00 AM,False,,False,0,False,True,249
0,6,Judicial,63590,Grays Harbor Superior Court,Grays Harbor,88,Judge Position 3,4,1,4-year term,22625,Mark McCauley,,102 W Broadway Room 203,Montesano,WA,98563,,,,State,5/14/2012 8:20:00 AM,False,,False,0,False,True,244
0,6,Judicial,63590,Grays Harbor Superior Court,Grays Harbor,87,Judge Position 2,4,1,4-year term,22629,Dave Edwards,,102 W Broadway Room 203,Montesano,WA,98563,,,,State,5/14/2012 8:25:00 AM,False,,False,0,False,True,243
0,2,State Executive,55,Washington State,Statewide,15,Secretary of State,4,1,4-year term,22633,Kathleen Drew,(Prefers Democratic Party),120 State Ave NE #1042,Olympia,WA,98501,(206) 979-5467,kathleendrew2012@gmail.com,,State,5/14/2012 8:26:00 AM,False,,False,0,True,True,10
0,6,Judicial,63590,Grays Harbor Superior Court,Grays Harbor,86,Judge Position 1,4,1,4-year term,22632,Gordon L. Godfrey,,102 W Broadway Room 203,Montesano,WA,98563,,,,State,5/14/2012 8:27:00 AM,False,,False,0,False,True,242
0,6,Judicial,63584,Clallam Superior Court,Clallam,68,Judge Position 1,4,1,4-year term,22662,Christopher Melly,,307 W 6th Street,Port Angeles,WA,98362,(360) 452-6385,cmelly@olypen.com,,State,5/14/2012 8:43:00 AM,False,,False,0,False,True,218
0,6,Judicial,63608,Whatcom Superior Court,Whatcom,111,Judge Position 2,4,1,4-year term,22675,Deborra Garrett,,PO Box 943,Bellingham,WA,98227,(360) 733-0127,info@dgarrettforjudge.com,,State,5/14/2012 8:47:00 AM,False,,False,0,False,True,389
0,5,Legislative,63444,Legislative District 39,"King*, Skagit*, Snohomish*",343,State Senator,4,1,4-year term,22679,Kirk Pearson,(Prefers Republican Party),105 Pearson Ln,Monroe,WA,98272,(360) 794-1156,pearson_k@frontier.com,,State,5/14/2012 8:48:00 AM,False,,False,0,True,True,142
0,5,Legislative,63424,Legislative District 19,"Cowlitz*, Grays Harbor*, Lewis*, Pacific, Wahkiakum",284,State Representative Pos. 1,2,1,2-year term,22683,Dean Takko,(Prefers Democratic Party),PO Box 1025,Longview,WA,98632,(360) 423-4589,DTakko@comcast.net,,State,5/14/2012 8:50:00 AM,False,,False,0,True,True,83
0,5,Legislative,162,Legislative District 8,Benton*,252,State Representative Pos. 2,2,1,2-year term,23180,Larry Haler,(Prefers Republican Party),P.O. Box 1319,Richland,WA,99352,(509) 308-1957,le.haler@gmail.com,,State,5/14/2012 8:53:00 AM,False,,False,0,True,True,51
0,6,Judicial,52,Supreme Court,Statewide,23,Justice Position 2,6,1,6-year term,22696,Susan Owens,,6963 Littlerock Rd SW,Olympia,WA,98512-7246,(360) 866-6052,sowens@olypen.com,,State,5/14/2012 8:58:00 AM,False,,False,0,False,True,176
0,6,Judicial,63599,Mason Superior Court,Mason,103,Judge Position 2,4,1,4-year term,22735,Toni A. Sheldon,,PO Box 727 ,Shelton,WA,98584,(360) 877-5105,potlatch@hctc.com,,State,5/14/2012 9:01:00 AM,False,,False,0,False,True,319
0,6,Judicial,63607,Walla Walla  Superior Court,Walla Walla,108,Judge Position 1,4,1,4-year term,22695,John W. Lohrmann,,1815   Fern Ave,Walla Walla,WA,99362,(509) 629-3130,johnlohrmann@charter.net,,State,5/14/2012 9:01:00 AM,False,,False,0,False,True,386
0,6,Judicial,63583,Chelan Superior Court,Chelan,67,Judge Position 2,4,1,4-year term,22714,T.W "Chip" Small,,3519   Kimberly Ct,Wenatchee,WA,98801,(509) 679-0169,,,State,5/14/2012 9:04:00 AM,False,,False,0,False,True,216
0,6,Judicial,63589,Grant Superior Court,Grant,85,Judge Position 3,4,1,4-year term,22712,John Antosz,,345   4th Ave SE,Ephrata,WA,98823,(509) 754-2011,,,State,5/14/2012 9:04:00 AM,False,,False,0,False,True,241
0,5,Legislative,63454,Legislative District 49,Clark*,374,State Representative Pos. 1,2,1,2-year term,22748,Sharon Wylie,(Prefers Democratic Party),"1111 Main Street, Suite 400",VANCOUVER,WA,98660,(360) 921-5716,swylie2@gmail.com,,State,5/14/2012 9:05:00 AM,False,,False,0,True,True,173
0,5,Legislative,158,Legislative District 6,Spokane*,245,State Representative Pos. 2,2,1,2-year term,22745,Jeff Holy,(Prefers Republican Party),PO Box 40285,Spokane,WA,99220,(509) 747-5840,votejeffholy@gmail.com,,State,5/14/2012 9:08:00 AM,False,,False,0,True,True,45
0,6,Judicial,63583,Chelan Superior Court,Chelan,66,Judge Position 1,4,1,4-year term,22740,Lesley A. Allan,,19  N Garfield Ave,Wenatchee,WA,98801,(509) 663-3743,,,State,5/14/2012 9:08:00 AM,False,,False,0,False,True,215
0,5,Legislative,63434,Legislative District 29,Pierce*,315,State Representative Pos. 2,2,1,2-year term,22739,Steve Kirby,(Prefers Democratic Party),9415 Tacoma Ave S,Tacoma,WA,98444,(253) 473-3663,stevekirby@harbornet.com,,State,5/14/2012 9:09:00 AM,False,,False,0,True,True,114
0,5,Legislative,63430,Legislative District 25,Pierce*,301,State Senator,4,1,4-year term,22753,Bruce Dammeier,(Prefers Republican Party),PO Box 398,Puyallup,WA,98371,(253) 370-7198,bruce@brucedammeier.com,,State,5/14/2012 9:12:00 AM,False,,False,0,True,True,100
0,5,Legislative,63424,Legislative District 19,"Cowlitz*, Grays Harbor*, Lewis*, Pacific, Wahkiakum",285,State Representative Pos. 2,2,1,2-year term,22771,Brian E. Blake,(Prefers Democratic Party),PO Box 1541,Longview,WA,98632,(360) 589-0123,repbrianblake@msn.com,,State,5/14/2012 9:13:00 AM,False,,False,0,True,True,84
0,5,Legislative,63449,Legislative District 44,Snohomish*,359,State Representative Pos. 1,2,1,2-year term,22762,Mark Harmsworth,(Prefers Republican Party),PO Box 13581,Mill Creek,WA,98082,(425) 418-6134,markharm@markharmsworth.com,,State,5/14/2012 9:14:00 AM,False,,False,0,True,True,158
0,5,Legislative,63440,Legislative District 35,"Kitsap*, Mason, Thurston*",333,State Representative Pos. 2,2,1,2-year term,22767,Drew C. MacEwen,(Prefers Republican Party),PO Box 651,Union,WA,98592,(360) 250-0730,votedrewmac@gmail.com,,State,5/14/2012 9:16:00 AM,False,,False,0,True,True,132
0,2,State Executive,55,Washington State,Statewide,17,State Auditor,4,1,4-year term,22785,James Watkins,(Prefers Republican Party),PO Box 2213,Kirkland,WA,98083,(425) 390-4348,info@watkinsforauditor.com,,State,5/14/2012 9:18:00 AM,False,,False,0,True,True,12
0,3,Congressional,152,Congressional District 6,"Clallam, Grays Harbor, Jefferson, Kitsap, Mason*, Pierce*",9,U.S. Representative,2,1,2-year term,22787,Derek Kilmer,(Prefers Democratic Party),PO Box 1574,Gig Harbor,WA,98335,(253) 759-3061,info@derekkilmer.com,,State,5/14/2012 9:18:00 AM,False,,False,0,True,True,23
0,6,Judicial,63458,"Court of Appeals, Division 2, District 2","Clallam, Grays Harbor, Jefferson, Kitsap, Mason, Thurston",45,Judge Position 2,6,1,6-year term,22783,Pamela (Pam) Loginsky,,PO Box 388,Port Orchard,WA,98366,(360) 895-3122,pamloginsky@wavecable.com,,State,5/14/2012 9:18:00 AM,False,,False,0,False,True,198
0,5,Legislative,63433,Legislative District 28,Pierce*,312,State Representative Pos. 2,2,1,2-year term,22807,Paul Wagemann,(Prefers Republican Party),8920 Butte Terrace SW,Lakewood,WA,98498,(253) 209-5638,wagemanp@stolz.com,,State,5/14/2012 9:22:00 AM,False,,False,0,True,True,111
0,6,Judicial,52,Supreme Court,Statewide,29,Justice Position 8,6,4,6-year short and full term,22800,Steve Gonzalez,,PO Box 12316,Seattle,WA,98111,(360) 207-1789,info@justicegonzalez.com,,State,5/14/2012 9:22:00 AM,False,,False,0,False,True,182
0,5,Legislative,63440,Legislative District 35,"Kitsap*, Mason, Thurston*",333,State Representative Pos. 2,2,1,2-year term,22812,Lynda Ring-Erickson,(Prefers Democratic Party),PO Box 1896,Shelton,WA,98584,(360) 427-2887,lyndare@hctc.com,,State,5/14/2012 9:23:00 AM,False,,False,0,True,True,132
0,5,Legislative,63418,Legislative District 13,"Grant*, Kittitas, Lincoln, Yakima*",267,State Representative Pos. 2,2,1,2-year term,22818,Matt Manweller ,(Prefers Republican Party),"110 W 6th Ave, PMB 392",Ellensburg,WA,98926,(509) 793-4598,matt@manwellerforstaterep.com,,State,5/14/2012 9:24:00 AM,False,,False,0,True,True,66
0,5,Legislative,63427,Legislative District 22,Thurston*,293,State Representative Pos. 1,2,1,2-year term,22856,Chris Reykdal,(Prefers Democratic Party),855 Trosper Rd SW Ste 108 PMB 117,Tumwater,WA,98512,(360) 790-3151,Chris4rep@gmail.com,,State,5/14/2012 9:25:00 AM,False,,False,0,True,True,92
0,5,Legislative,63443,Legislative District 38,Snohomish*,342,State Representative Pos. 2,2,1,2-year term,22821,Mike Sells,(Prefers Democratic Party),PO Box 12395,Everett,WA,98206,,mikesells@aol.com,,State,5/14/2012 9:25:00 AM,False,,False,0,True,True,141
0,5,Legislative,63436,Legislative District 31,"King*, Pierce*",320,State Representative Pos. 1,2,1,2-year term,22825,Cathy Dahlquist,(Prefers Republican Party),1348 Florence St,Enumclaw,WA,98022,(253) 653-3163,cathydahlquist@comcast.net,,State,5/14/2012 9:26:00 AM,False,,False,0,True,True,119
0,3,Congressional,148,Congressional District 2,"Island, San Juan, Skagit*, Snohomish*, Whatcom*",8,U.S. Representative,2,1,2-year term,22834,Dan Matthews,(Prefers Republican Party),PO Box 12457,Everett,WA,98206,(425) 530-8070,dan@danmatthewsforcongress.com,,State,5/14/2012 9:28:00 AM,False,,False,0,True,True,19
0,3,Congressional,154,Congressional District 8,"Chelan, Douglas*, King*, Kittitas, Pierce*",12,U.S. Representative,2,1,2-year term,22838,Dave Reichert,(Prefers Republican Party),PO Box 2032,Issaquah,WA,98027,(425) 455-3283,dave@davereichertforcongress.com,,State,5/14/2012 9:29:00 AM,False,,False,0,True,True,25
0,5,Legislative,63446,Legislative District 41,King*,349,State Senator,4,1,4-year term,25710,Steve Litzow,(Prefers Republican Party),7683 SE 27th St #431,Mercer Island,WA,98040,(206) 275-2245,info@stevelitzow.com,,State,5/14/2012 9:29:00 AM,False,,False,0,True,True,148
0,6,Judicial,63459,"Court of Appeals, Division 2, District 3","Clark, Cowlitz, Lewis, Pacific, Skamania, Wahkiakum",46,Judge Position 1,6,1,6-year term,22839,Joel Penoyar,,PO Box 897,South Bend,WA,98586,(360) 875-6342,joelpenoyar@gmail.com,,State,5/14/2012 9:29:00 AM,False,,False,0,False,True,199
0,6,Judicial,63597,Lewis Superior Court,Lewis,100,Judge Position 3,4,1,4-year term,22847,Richard L. Brosey,,103 Fir Dr,Chehalis,WA,98532,(360) 748-8286,Broseys@msn.com,,State,5/14/2012 9:29:00 AM,False,,False,0,False,True,316
0,5,Legislative,63449,Legislative District 44,Snohomish*,359,State Representative Pos. 1,2,1,2-year term,22858,Hans Dunshee,(Prefers Democratic Party),1526 Lake View Ave,Snohomish,WA,98290,(360) 568-5204,hansdunshee@comcast.net,,State,5/14/2012 9:31:00 AM,False,,False,0,True,True,158
0,5,Legislative,63421,Legislative District 16,"Benton*, Columbia, Franklin*, Walla Walla*",276,State Representative Pos. 2,2,1,2-year term,22859,Terry R. Nealey,(Prefers Republican Party),PO Box 7,Dayton,WA,99328,(509) 382-2541,tnealey@nealey-marinella.com,,State,5/14/2012 9:33:00 AM,False,,False,0,True,True,75
0,6,Judicial,63601,"Pacific, Wahkiakum Superior Court","Pacific, Wahkiakum",64,Judge Position 1,4,1,4-year term,22880,Mike Sullivan,,PO Box 198 ,Menlo,WA,98561,(360) 942-9661,mjsullivan@centurytel.net,,State,5/14/2012 9:37:00 AM,False,,False,0,False,True,323
0,5,Legislative,63443,Legislative District 38,Snohomish*,341,State Representative Pos. 1,2,1,2-year term,22892,John McCoy,(Prefers Democratic Party),PO Box 1821,Marysville,WA,98271,(425) 350-5535,johnmccoy1@me.com,,State,5/14/2012 9:40:00 AM,False,,False,0,True,True,140
0,5,Legislative,63425,Legislative District 20,"Clark*, Cowlitz*, Lewis*, Thurston*",288,State Representative Pos. 2,2,1,2-year term,22908,Ed Orcutt,(Prefers Republican Party),PO Box 1280,Kalama,WA,98625,(360) 751-2317,ElectEdOrcutt@kalama.com,,State,5/14/2012 9:44:00 AM,False,,False,0,True,True,87
0,2,State Executive,55,Washington State,Statewide,20,Superintendent of Public Instruction,4,1,4-year term,22926,Randy I. Dorn,,PO Box 5499,Lacey,WA,98509,(253) 256-2147,info@randydorn2012.com,,State,5/14/2012 9:47:00 AM,False,,False,0,False,True,15
0,5,Legislative,101,Legislative District 3,Spokane*,234,State Senator,4,1,4-year term,22921,Nancy McLaughlin,(Prefers G.O.P. Party),PO Box 10208,Spokane,WA,99209,(509) 868-5890,info@nancy4senate.com,,State,5/14/2012 9:49:00 AM,False,,False,0,True,True,34
0,5,Legislative,63429,Legislative District 24,"Clallam, Grays Harbor*, Jefferson",299,State Representative Pos. 1,2,1,2-year term,22927,Kevin Van De Wege,(Prefers Democratic Party),10 Sable Court,Sequim,WA,98382,(360) 477-0548,kevinvandewege@hotmail.com,,State,5/14/2012 9:51:00 AM,False,,False,0,True,True,98
0,5,Legislative,63451,Legislative District 46,King*,366,State Representative Pos. 2,2,1,2-year term,25726,Sarajane Siegfriedt,(Prefers Democratic Party),11811 33rd Ave NE,Seattle,WA,98125,(360) 721-5307,info@sarajaneforhouse.com,,State,5/14/2012 9:52:00 AM,False,,False,0,True,True,165
0,5,Legislative,63434,Legislative District 29,Pierce*,314,State Representative Pos. 1,2,1,2-year term,22934,Terry Harder,(Prefers Republican Party),708 E 84th St,Tacoma,WA,98445,(253) 279-8513,terryharder@comcast.net,,State,5/14/2012 9:55:00 AM,False,,False,0,True,True,113
0,5,Legislative,156,Legislative District 4,Spokane*,238,State Representative Pos. 1,2,1,2-year term,22939,Larry Crouse,(Prefers Republican Party),10705 E 44th Ave,Spokane Vly,WA,99206,(509) 924-6029,crouse588@comcast.net,,State,5/14/2012 9:56:00 AM,False,,False,0,True,True,38
0,5,Legislative,63433,Legislative District 28,Pierce*,311,State Representative Pos. 1,2,1,2-year term,22941,Steve O'Ban,(Prefers Republican Party),PO Box 65335,University Place,WA,98464,(253) 312-1688,steve@steveoban.com,,State,5/14/2012 9:57:00 AM,False,,False,0,True,True,110
0,5,Legislative,63452,Legislative District 47,King*,369,State Representative Pos. 2,2,1,2-year term,25735,Andy Massagli,(Prefers Republican Party),12932 SE Kent Kangley Rd #2,Kent,WA,98030,(253) 245-1905,Massagli47@gmail.com,,State,5/14/2012 9:57:00 AM,False,,False,0,True,True,168
0,5,Legislative,158,Legislative District 6,Spokane*,245,State Representative Pos. 2,2,1,2-year term,22953,Dennis Dellwo,(Prefers Democratic Party),PO Box 31102,Spokane,WA,99223,(509) 731-3389,dennis@electdellwo.com,,State,5/14/2012 9:59:00 AM,False,,False,0,True,True,45
0,6,Judicial,63460,"Court of Appeals, Division 3, District 1","Ferry, Lincoln, Okanogan, Pend Oreille, Spokane, Stevens",48,Judge Position 1,6,1,6-year term,22955,Laurel Siddoway,,1821 S Upper Terrace Rd,Spokane,WA,99203,(509) 624-8066,lhsiddoway@gmail.com,,State,5/14/2012 10:02:00 AM,False,,False,0,False,True,201
0,2,State Executive,55,Washington State,Statewide,18,Attorney General,4,1,4-year term,22967,Reagan Dunn,(Prefers Republican Party),PO Box 40417,Bellevue,WA,98015,(206) 232-0339,info@reagandunn.com,,State,5/14/2012 10:06:00 AM,False,,False,0,True,True,13
0,3,Congressional,154,Congressional District 8,"Chelan, Douglas*, King*, Kittitas, Pierce*",12,U.S. Representative,2,1,2-year term,22964,Karen Porterfield,(Prefers Democratic Party),PO Box 1950 ,Issaquah,WA,98027,(425) 961-0710,KPorterfield@karenporterfield4congress.com,,State,5/14/2012 10:06:00 AM,False,,False,0,True,True,25
0,6,Judicial,63587,Douglas Superior Court ,Douglas,82,Judge Position 1,4,1,4-year term,23209,John Hotchkiss,,2451   FANCHER HEIGHTS BLVD,EAST WENATCHEE,WA,98802,,,,State,5/14/2012 10:08:00 AM,False,,False,0,False,True,236
0,5,Legislative,63445,Legislative District 40,"San Juan, Skagit*, Whatcom*",347,State Representative Pos. 1,2,1,2-year term,22981,Kristine Lytton,(Prefers Democratic Party),"1004 Commercial Ave, PMB 349",Anacortes,WA,98221,(360) 299-4542,MrLytton@fidalgo.net,,State,5/14/2012 10:13:00 AM,False,,False,0,True,True,146
0,5,Legislative,63437,Legislative District 32,"King*, Snohomish*",323,State Representative Pos. 1,2,1,2-year term,22990,Cindy Ryu,(Prefers Democratic Party),PO Box 33548,Seattle,WA,98133,(206) 605-1588,FriendsForCindyRyu@yahoo.com,,State,5/14/2012 10:15:00 AM,False,,False,0,True,True,122
0,6,Judicial,63457,"Court of Appeals, Division 2, District 1",Pierce,43,Judge Position 3,6,1,6-year term,22989,Christine Quinn-Brintnall,,2909 N 19th St,Tacoma,WA,98406,(253) 219-0481,chris@QBappeals.org,,State,5/14/2012 10:15:00 AM,False,,False,0,False,True,196
0,6,Judicial,52,Supreme Court,Statewide,30,Justice Position 9,6,1,6-year term,22992,Sheryl Gordon McCloud,,710 Cherry St,Seattle,WA,98104,(206) 418-9228,sheryl@mccloudforjustice.com,,State,5/14/2012 10:18:00 AM,False,,False,0,False,True,183
0,5,Legislative,63417,Legislative District 12,"Chelan, Douglas, Grant*, Okanogan*",263,State Representative Pos. 1,2,1,2-year term,23006,Stan Morse,(Prefers Republican Party),PO Box 2128,Chelan,WA,98816,(509) 682-7239,stan@stanmorse.com,,State,5/14/2012 10:25:00 AM,False,,False,0,True,True,62
0,1,Federal,49,United States,Statewide,2,U.S. Senator,6,1,6-year term,23036,Michael Baumgartner,(Prefers Republican Party),218 Main St Ste 704,Kirkland,WA,98033,(206) 337-2242,michael@VoteBaumgartner.com,,State,5/14/2012 10:28:00 AM,False,,False,0,True,True,4
0,3,Congressional,149,Congressional District 3,"Clark, Cowlitz, Klickitat, Lewis, Pacific, Skamania, Thurston*, Wahkiakum",5,U.S. Representative,2,1,2-year term,23030,Jon T. Haugen,(Prefers Democratic Party),13502 NW 49th Ave,Vancouver,WA,98685,(360) 907-8340,Jon@HaugenVet.com,,State,5/14/2012 10:32:00 AM,False,,False,0,True,True,20
0,5,Legislative,63427,Legislative District 22,Thurston*,292,State Senator,4,1,4-year term,23057,Karen Fraser,(Prefers Democratic Party),7806 Cooper Point Rd NW,Olympia,WA,98502,(360) 250-6261,karenfraser2012@comcast.net,,State,5/14/2012 10:33:00 AM,False,,False,0,True,True,91
0,5,Legislative,63426,Legislative District 21,Snohomish*,290,State Representative Pos. 1,2,1,2-year term,23047,Mary Helen Roberts,(Prefers Democratic Party),3924 149th Pl SW,Lynnwood,WA,98087,(425) 742-0611,maryhelenr@frontier.com,,State,5/14/2012 10:37:00 AM,False,,False,0,True,True,89
0,5,Legislative,63430,Legislative District 25,Pierce*,303,State Representative Pos. 2,2,1,2-year term,23050,Bill Hilton,(Prefers Democratic Party),926   21st St NW,Puyallup,WA,98371,(253) 302-1104,bill@electbillhilton.com,,State,5/14/2012 10:38:00 AM,False,,False,0,True,True,102
0,5,Legislative,63424,Legislative District 19,"Cowlitz*, Grays Harbor*, Lewis*, Pacific, Wahkiakum",283,State Senator,4,1,4-year term,23054,Rick Winsman,(Prefers Republican Party),19 View Ridge Circle,Longview,WA,98632,(360) 430-5012,rick.winsman@pegasusgroupllc.com,,State,5/14/2012 10:40:00 AM,False,,False,0,True,True,82
0,5,Legislative,63425,Legislative District 20,"Clark*, Cowlitz*, Lewis*, Thurston*",287,State Representative Pos. 1,2,1,2-year term,23079,Richard DeBolt,(Prefers Republican Party),1673 S Market St Ste 159,Chehalis,WA,98532,(360) 219-7072,arnydvs@gmail.com,,State,5/14/2012 10:47:00 AM,False,,False,0,True,True,86
0,5,Legislative,63445,Legislative District 40,"San Juan, Skagit*, Whatcom*",348,State Representative Pos. 2,2,1,2-year term,23070,Jeff Morris,(Prefers Democratic Party),1004 Commercial Ave #303,Anacortes,WA,98221,(360) 941-6860,jeff@morriscampaign.com,,State,5/14/2012 10:48:00 AM,False,,False,0,True,True,147
0,6,Judicial,63588,"Ferry, Pend Oreille, Stevens Superior Court","Ferry, Pend Oreille, Stevens",60,Judge Position 2,4,1,4-year term,23072,Allen Nielson,,18 Ponderosa Park Dr,Kettle Falls,WA,99141,(509) 738-9238,katewnielson@yahoo.com,,State,5/14/2012 10:48:00 AM,False,,False,0,False,True,238
0,5,Legislative,63417,Legislative District 12,"Chelan, Douglas, Grant*, Okanogan*",264,State Representative Pos. 2,2,1,2-year term,23084,Mike Armstrong,(Prefers Republican Party),PO Box 2974,Wenatchee,WA,98807,(509) 663-0629,armstrhome@msn.com,,State,5/14/2012 10:55:00 AM,False,,False,0,True,True,63
0,5,Legislative,158,Legislative District 6,Spokane*,244,State Representative Pos. 1,2,1,2-year term,23096,Wayne Kyle Spitzer,(Prefers Democratic Party),PO Box 31082,Spokane,WA,99223,(509) 220-5535,spitzerforthepeople@gmail.com,,State,5/14/2012 10:57:00 AM,True,5/21/2012 12:06:00 PM,False,0,True,True,44
0,3,Congressional,150,Congressional District 4,"Adams, Benton, Douglas*, Franklin, Grant, Okanogan, Walla Walla*, Yakima",7,U.S. Representative,2,1,2-year term,23090,Doc Hastings,(Prefers Republican Party),PO Box 2926,Pasco,WA,99302,(509) 736-1510,doc@dochastings.com,,State,5/14/2012 10:58:00 AM,False,,False,0,True,True,21
0,5,Legislative,63444,Legislative District 39,"King*, Skagit*, Snohomish*",344,State Representative Pos. 1,2,1,2-year term,23093,Dan Kristiansen,(Prefers Republican Party),PO Box 2007,Snohomish,WA,98291,(425) 870-6902,dk39@clearwire.net,,State,5/14/2012 10:58:00 AM,False,,False,0,True,True,143
0,1,Federal,49,United States,Statewide,2,U.S. Senator,6,1,6-year term,23100,Maria Cantwell,(Prefers Democratic Party),PO Box 12740,Seattle,WA,98111,(206) 285-2012,maria@cantwell.com,,State,5/14/2012 11:01:00 AM,False,,False,0,True,True,4
0,5,Legislative,63419,Legislative District 14,"Clark*, Klickitat, Skamania, Yakima*",268,State Senator,4,1,4-year term,23107,Curtis King,(Prefers Republican Party),PO Box 10025,Yakima,WA,98909,(509) 952-4667,senatorking@charter.net,,State,5/14/2012 11:05:00 AM,False,,False,0,True,True,67